Reaction Details
TargetD(4) dopamine receptor
LigandBDBM50058234
Substrate/Competitorn/a
Meas. Tech.ChEMBL_60667 (CHEMBL671703)
Ki 6.5±n/a nM
Citation Glase, SAAkunne, HCGeorgic, LMHeffner, TGMacKenzie, RGManley, PJPugsley, TAWise, LD Substituted [(4-phenylpiperazinyl)-methyl]benzamides: selective dopamine D4 agonists. J Med Chem40:1771-2 (1997) 
 
D(4) dopamine receptor
Name:D(4) dopamine receptor
Type:Enzyme
Mol. Mass.:48373.19
Organism:Homo sapiens (Human)
Description:P21917
Residue:419
BDBM50058234
NameBDBM50058234
Synonyms:CHEMBL300956 | N-[4-(2-Cyano-phenyl)-piperazin-1-ylmethyl]-4-methyl-benzamide
TypeSmall organic molecule
Emp. Form.C20H22N4O
Mol. Mass.334.4149
SMILESCc1ccc(cc1)C(=O)NCN1CCN(CC1)c1ccccc1C#N