Reaction Details
TargetD(3) dopamine receptor
LigandBDBM50058227
Substrate/Competitorn/a
Meas. Tech.ChEMBL_62128 (CHEMBL673449)
Ki 177±n/a nM
Citation Glase, SAAkunne, HCGeorgic, LMHeffner, TGMacKenzie, RGManley, PJPugsley, TAWise, LD Substituted [(4-phenylpiperazinyl)-methyl]benzamides: selective dopamine D4 agonists. J Med Chem40:1771-2 (1997) 
 
D(3) dopamine receptor
Name:D(3) dopamine receptor
Type:n/a
Mol. Mass.:44243.43
Organism:Homo sapiens (Human)
Description:n/a
Residue:400
BDBM50058227
NameBDBM50058227
Synonyms:CHEMBL298763 | N-[4-(2-Chloro-phenyl)-piperazin-1-ylmethyl]-benzamide
TypeSmall organic molecule
Emp. Form.C18H20ClN3O
Mol. Mass.329.824
SMILESClc1ccccc1N1CCN(CNC(=O)c2ccccc2)CC1