Reaction Details
TargetAdenosine receptor A1
LigandBDBM50003019
Substrate/Competitorn/a
Meas. Tech.ChEMBL_27901 (CHEMBL640561)
Ki 0.72±n/a nM
Citation Pfister, JRBelardinelli, LLee, GLum, RTMilner, PStanley, WCLinden, JBaker, SPSchreiner, G Synthesis and biological evaluation of the enantiomers of the potent and selective A1-adenosine antagonist 1,3-dipropyl-8-[2-(5,6-epoxynorbonyl)]-xanthine. J Med Chem40:1773-8 (1997) 
 
Adenosine receptor A1
Name:Adenosine receptor A1
Type:G Protein-Coupled Receptor (GPCR)
Mol. Mass.:36520.92
Organism:Homo sapiens (Human)
Description:P30542
Residue:326
BDBM50003019
NameBDBM50003019
Synonyms:8-(Hexahydro-2,5-methano-pentalen-3a-yl)-1,3-dipropyl-3,7-dihydro-purine-2,6-dione KW-3902
TypeSmall organic molecule
Emp. Form.C20H28N4O2
Mol. Mass.356.4619
SMILESCCCn1c2nc([nH]c2c(=O)n(CCC)c1=O)C12CC3CC1CC(C2)C3