Reaction Details
TargetMyosin light chain kinase, smooth muscle
LigandBDBM6760
Substrate/Competitorn/a
Meas. Tech.ChEMBL_202414 (CHEMBL805569)
IC50 0.020000±n/a nM
Citation Kaneko, MSaito, YSaito, HMatsumoto, TMatsuda, YVaught, JLDionne, CAAngeles, TSGlicksman, MANeff, NTRotella, DPKauer, JCMallamo, JPHudkins, RLMurakata, C Neurotrophic 3,9-bis[(alkylthio)methyl]-and-bis(alkoxymethyl)-K-252a derivatives. J Med Chem40:1863-9 (1997) 
 
Myosin light chain kinase, smooth muscle
Name:Myosin light chain kinase, smooth muscle
Type:Enzyme
Mol. Mass.:210423.57
Organism:Gallus gallus (chicken)
Description:n/a
Residue:1906
BDBM6760
NameBDBM6760
Synonyms:(+)-K-252a K-252a | methyl (15S,16R,18R)-16-hydroxy-15-methyl-3-oxo-28-oxa-4,14,19-triazaoctacyclo[12.11.2.1^{15,18}.0^{2,6}.0^{7,27}.0^{8,13}.0^{19,26}.0^{20,25}]octacosa-1(26),2(6),7(27),8(13),9,11,20(25),21,23-nonaene-16-carboxylate
TypeSmall organic molecule
Emp. Form.C27H21N3O5
Mol. Mass.467.4727
SMILESCOC(=O)[C@@]1(O)C[C@H]2O[C@]1(C)n1c3ccccc3c3c4CNC(=O)c4c4c5ccccc5n2c4c13