Reaction Details
TargetCaspase-1
LigandBDBM50058527
Substrate/Competitorn/a
Meas. Tech.ChEMBL_90980 (CHEMBL696527)
Ki 6±n/a nM
Citation Dolle, REPrasad, CVProuty, CPSalvino, JMAwad, MMSchmidt, SJHoyer, DRoss, TMGraybill, TLSpeier, GJUhl, JMiller, BEHelaszek, CTAtor, MA Pyridazinodiazepines as a high-affinity, P2-P3 peptidomimetic class of interleukin-1 beta-converting enzyme inhibitor. J Med Chem40:1941-6 (1997) 
 
Caspase-1
Name:Caspase-1
Type:Enzyme
Mol. Mass.:45154.13
Organism:Homo sapiens (Human)
Description:P29466
Residue:404
BDBM50058527
NameBDBM50058527
Synonyms:(S)-2-[(S)-2-((S)-2-Acetylamino-3-methyl-butyrylamino)-propionylamino]-succinic acid | CHEMBL61023
TypeSmall organic molecule
Emp. Form.C14H23N3O7
Mol. Mass.345.3483
SMILESCC(C)[C@H](NC(C)=O)C(=O)N[C@@H](C)C(=O)N[C@@H](CC(O)=O)C(O)=O