Reaction Details
TargetPhosphodiesterase
LigandBDBM50059050
Substrate/Competitorn/a
Meas. Tech.ChEMBL_156454 (CHEMBL764832)
IC50 1000±n/a nM
Citation Ahn, HSBercovici, ABoykow, GBronnenkant, AChackalamannil, SChow, JCleven, RCook, JCzarniecki, MDomalski, CFawzi, AGreen, MGündes, AHo, GLaudicina, MLindo, NMa, KManna, MMcKittrick, BMirzai, BNechuta, TNeustadt, BPuchalski, CPula, KZhang, H Potent tetracyclic guanine inhibitors of PDE1 and PDE5 cyclic guanosine monophosphate phosphodiesterases with oral antihypertensive activity. J Med Chem40:2196-210 (1997) 
 
Phosphodiesterase
Name:Phosphodiesterase
Type:PROTEIN
Mol. Mass.:124301.20
Organism:Bos taurus
Description:ChEMBL_156453
Residue:1115
BDBM50059050
NameBDBM50059050
Synonyms:(6aR,9aS)-2-(Biphenylmethyl)-5,6a,7,8,9,9a-hexahydro-5-methylcyclopent[4,5]imidazo[2,1-b]purin-4(3H)-one | CHEMBL304389
TypeSmall organic molecule
Emp. Form.C24H23N5O
Mol. Mass.397.4723
SMILESCN1C2=N[C@@H]3CCC[C@@H]3N2c2nc(Cc3ccc(cc3)-c3ccccc3)[nH]c2C1=O