Reaction Details
TargetPhosphodiesterase
LigandBDBM50059016
Substrate/Competitorn/a
Meas. Tech.ChEMBL_156454 (CHEMBL764832)
IC50 26000±n/a nM
Citation Ahn, HSBercovici, ABoykow, GBronnenkant, AChackalamannil, SChow, JCleven, RCook, JCzarniecki, MDomalski, CFawzi, AGreen, MGündes, AHo, GLaudicina, MLindo, NMa, KManna, MMcKittrick, BMirzai, BNechuta, TNeustadt, BPuchalski, CPula, KZhang, H Potent tetracyclic guanine inhibitors of PDE1 and PDE5 cyclic guanosine monophosphate phosphodiesterases with oral antihypertensive activity. J Med Chem40:2196-210 (1997) 
 
Phosphodiesterase
Name:Phosphodiesterase
Type:PROTEIN
Mol. Mass.:124301.20
Organism:Bos taurus
Description:ChEMBL_156453
Residue:1115
BDBM50059016
NameBDBM50059016
Synonyms:5'-Methyl-2'-(biphenylmethyl)spiro[cyclopentane-1,7'(8'H)-[3H]imidazo[2,1-b]purin]-4(5'H)-one | CHEMBL303154
TypeSmall organic molecule
Emp. Form.C25H25N5O
Mol. Mass.411.4989
SMILESCN1C2=NC3(CCCC3)CN2c2nc(Cc3ccc(cc3)-c3ccccc3)[nH]c2C1=O