Reaction Details
TargetReverse transcriptase/RNaseH
LigandBDBM50027536
Substrate/Competitorn/a
Meas. Tech.ChEMBL_196519 (CHEMBL798333)
IC50 17600±n/a nM
Citation Kim, DKGam, JKim, YWLim, JKim, HTKim, KH Synthesis and anti-HIV-1 activity of a series of 1-alkoxy-5-alkyl-6-(arylthio)uracils. J Med Chem40:2363-73 (1997) 
 
Reverse transcriptase/RNaseH
Name:Reverse transcriptase/RNaseH
Type:PROTEIN
Mol. Mass.:65229.15
Organism:Human immunodeficiency virus 1
Description:ChEMBL_1473730
Residue:566
BDBM50027536
NameBDBM50027536
Synonyms:(phosphonoformate)Trisodium phosphonoformate CHEMBL754 FOSCARNET SODIUM Foscavir trisodium dioxidophosphinecarboxylate oxide trisodium phosphonoformate
TypeSmall organic molecule
Emp. Form.CO5P
Mol. Mass.122.9831
SMILES[O-]C(=O)P([O-])([O-])=O