Reaction Details
TargetTrifunctional purine biosynthetic protein adenosine-3
LigandBDBM50059339
Substrate/Competitorn/a
Meas. Tech.ChEMBL_72910 (CHEMBL684724)
Ki 35±n/a nM
Citation Varney, MDPalmer, CLRomines, WHBoritzki, TMargosiak, SAAlmassy, RJanson, CABartlett, CHowland, EJFerre, R Protein structure-based design, synthesis, and biological evaluation of 5-thia-2,6-diamino-4(3H)-oxopyrimidines: potent inhibitors of glycinamide ribonucleotide transformylase with potent cell growth inhibition. J Med Chem40:2502-24 (1997) 
 
Trifunctional purine biosynthetic protein adenosine-3
Name:Trifunctional purine biosynthetic protein adenosine-3
Type:Protein
Mol. Mass.:107768.47
Organism:Homo sapiens (Human)
Description:P22102
Residue:1010
BDBM50059339
NameBDBM50059339
Synonyms:2-{4-[2-(2-Amino-4-oxo-4,6,7,8-tetrahydro-3H-pyrimido[5,4-b][1,4]thiazin-6-yl)-ethyl]-benzoylamino}-pentanedioic acid | CHEMBL315076
TypeSmall organic molecule
Emp. Form.C20H23N5O6S
Mol. Mass.461.492
SMILESNc1nc2NCC(CCc3ccc(cc3)C(=O)NC(CCC(O)=O)C(O)=O)Sc2c(=O)[nH]1