Reaction Details
TargetTrifunctional purine biosynthetic protein adenosine-3
LigandBDBM50059334
Substrate/Competitorn/a
Meas. Tech.ChEMBL_72910 (CHEMBL684724)
Ki 35±n/a nM
Citation Varney, MDPalmer, CLRomines, WHBoritzki, TMargosiak, SAAlmassy, RJanson, CABartlett, CHowland, EJFerre, R Protein structure-based design, synthesis, and biological evaluation of 5-thia-2,6-diamino-4(3H)-oxopyrimidines: potent inhibitors of glycinamide ribonucleotide transformylase with potent cell growth inhibition. J Med Chem40:2502-24 (1997) 
 
Trifunctional purine biosynthetic protein adenosine-3
Name:Trifunctional purine biosynthetic protein adenosine-3
Type:Protein
Mol. Mass.:107768.47
Organism:Homo sapiens (Human)
Description:P22102
Residue:1010
BDBM50059334
NameBDBM50059334
Synonyms:(S)-2-({5-[3-(2,4-Diamino-6-oxo-1,6-dihydro-pyrimidin-5-ylsulfanyl)-propyl]-thiophene-2-carbonyl}-amino)-pentanedioic acid | CHEMBL85871
TypeSmall organic molecule
Emp. Form.C17H21N5O6S2
Mol. Mass.455.509
SMILESNc1nc(N)c(SCCCc2ccc(s2)C(=O)N[C@@H](CCC(O)=O)C(O)=O)c(=O)[nH]1