Reaction Details
TargetFolate receptor alpha
LigandBDBM50059333
Substrate/Competitorn/a
Meas. Tech.ChEMBL_68374 (CHEMBL678783)
Kd 0.0005±n/a nM
Citation Varney, MDPalmer, CLRomines, WHBoritzki, TMargosiak, SAAlmassy, RJanson, CABartlett, CHowland, EJFerre, R Protein structure-based design, synthesis, and biological evaluation of 5-thia-2,6-diamino-4(3H)-oxopyrimidines: potent inhibitors of glycinamide ribonucleotide transformylase with potent cell growth inhibition. J Med Chem40:2502-24 (1997) 
 
Folate receptor alpha
Name:Folate receptor alpha
Type:PROTEIN
Mol. Mass.:29827.41
Organism:Homo sapiens (Human)
Description:ChEMBL_1469596
Residue:257
BDBM50059333
NameBDBM50059333
Synonyms:(R)-2-({5-[2-(2-Amino-4-oxo-4,6,7,8-tetrahydro-3H-pyrimido[5,4-b][1,4]thiazin-6-yl)-ethyl]-thiophene-2-carbonyl}-amino)-pentanedioic acid | CHEMBL85436
TypeSmall organic molecule
Emp. Form.C18H21N5O6S2
Mol. Mass.467.519
SMILESNc1nc2NCC(CCc3ccc(s3)C(=O)N[C@H](CCC(O)=O)C(O)=O)Sc2c(=O)[nH]1