Reaction Details
TargetDelta-type opioid receptor
LigandBDBM50059369
Substrate/Competitorn/a
Meas. Tech.ChEMBL_146898 (CHEMBL751672)
Ki 3.62±n/a nM
Citation Bryant, SDGuerrini, RSalvadori, SBianchi, CTomatis, RAttila, MLazarus, LH Helix-inducing alpha-aminoisobutyric acid in opioid mimetic deltorphin C analogues. J Med Chem40:2579-87 (1997) 
 
Delta-type opioid receptor
Name:Delta-type opioid receptor
Type:G Protein-Coupled Receptor (GPCR)
Mol. Mass.:40465.04
Organism:Rattus norvegicus (rat)
Description:Competition binding assays were using CHO-K1 cell membranes expressing the opioid receptor.
Residue:372
BDBM50059369
NameBDBM50059369
Synonyms:(R)-3-(2-{2-[(S)-2-Amino-3-(4-hydroxy-phenyl)-propionylamino]-2-methyl-propionylamino}-2-methyl-propionylamino)-N-{(S)-1-[(S)-1-(carbamoylmethyl-carbamoyl)-2-methyl-propylcarbamoyl]-2-methyl-propyl}-succinamic acid | CHEMBL441889
TypeSmall organic molecule
Emp. Form.C33H52N8O10
Mol. Mass.720.8136
SMILESCC(C)[C@H](NC(=O)[C@@H](NC(=O)[C@@H](CC(O)=O)NC(=O)C(C)(C)NC(=O)C(C)(C)NC(=O)[C@@H](N)Cc1ccc(O)cc1)C(C)C)C(=O)NCC(N)=O