Reaction Details
TargetAdenosine receptor A3
LigandBDBM50059375
Substrate/Competitorn/a
Meas. Tech.ChEMBL_32001 (CHEMBL646598)
Ki 18±n/a nM
Citation Jiang, Jvan Rhee, AMChang, LPatchornik, AJi, XDEvans, PMelman, NJacobson, KA Structure-activity relationships of 4-(phenylethynyl)-6-phenyl-1,4-dihydropyridines as highly selective A3 adenosine receptor antagonists. J Med Chem40:2596-608 (1997) 
 
Adenosine receptor A3
Name:Adenosine receptor A3
Type:G Protein-Coupled Receptor (GPCR)
Mol. Mass.:36197.32
Organism:Homo sapiens (Human)
Description:P0DMS8
Residue:318
BDBM50059375
NameBDBM50059375
Synonyms:5-Amino-3-(4-methoxy-phenyl)-thiazolo[3,2-a]pyrimidin-7-one | CHEMBL89472
TypeSmall organic molecule
Emp. Form.C13H11N3O2S
Mol. Mass.273.31
SMILESCOc1ccc(cc1)-c1csc2nc(=O)cc(N)n12