Reaction Details
TargetAdenosine receptor A2a
LigandBDBM50053929
Substrate/Competitorn/a
Meas. Tech.ChEMBL_30017 (CHEMBL641308)
Ki 52.0±n/a nM
Citation Jiang, Jvan Rhee, AMChang, LPatchornik, AJi, XDEvans, PMelman, NJacobson, KA Structure-activity relationships of 4-(phenylethynyl)-6-phenyl-1,4-dihydropyridines as highly selective A3 adenosine receptor antagonists. J Med Chem40:2596-608 (1997) 
 
Adenosine receptor A2a
Name:Adenosine receptor A2a
Type:G Protein-Coupled Receptor (GPCR)
Mol. Mass.:45015.65
Organism:Rattus norvegicus (rat)
Description:Rat A2A receptors expressed in CHO cells.
Residue:410
BDBM50053929
NameBDBM50053929
Synonyms:CHEMBL88147 N-(9-Chloro-2-furan-2-yl-[1,2,4]triazolo[1,5-c]quinazolin-5-yl)-N-methyl-2-phenyl-acetamide | N-(9-chloro-2-(furan-2-yl)-[1,2,4]triazolo[1,5-c]quinazolin-5-yl)-2-phenylacetamide
TypeSmall organic molecule
Emp. Form.C21H14ClN5O2
Mol. Mass.403.821
SMILESClc1ccc2nc(NC(=O)Cc3ccccc3)n3nc(nc3c2c1)-c1ccco1