Reaction Details
TargetAdenosine receptor A3
LigandBDBM50059412
Substrate/Competitorn/a
Meas. Tech.ChEMBL_32001 (CHEMBL646598)
Ki 70±n/a nM
Citation Jiang, Jvan Rhee, AMChang, LPatchornik, AJi, XDEvans, PMelman, NJacobson, KA Structure-activity relationships of 4-(phenylethynyl)-6-phenyl-1,4-dihydropyridines as highly selective A3 adenosine receptor antagonists. J Med Chem40:2596-608 (1997) 
 
Adenosine receptor A3
Name:Adenosine receptor A3
Type:G Protein-Coupled Receptor (GPCR)
Mol. Mass.:36197.32
Organism:Homo sapiens (Human)
Description:P0DMS8
Residue:318
BDBM50059412
NameBDBM50059412
Synonyms:2-Ethyl-6-phenyl-4-phenylethynyl-1,4-dihydro-pyridine-3,5-dicarboxylic acid 5-benzyl ester 3-ethyl ester | CHEMBL90282
TypeSmall organic molecule
Emp. Form.C32H29NO4
Mol. Mass.491.577
SMILESCCOC(=O)C1C(C#Cc2ccccc2)C(C(=O)OCc2ccccc2)=C(N=C1CC)c1ccccc1