Reaction Details
Target5-hydroxytryptamine receptor 1A
LigandBDBM50054351
Substrate/Competitorn/a
Meas. Tech.ChEMBL_1472 (CHEMBL616595)
Ki 11.3±n/a nM
Citation López-Rodríguez, MLMorcillo, MJFernández, EPorras, EMurcia, MSanz, AMOrensanz, L Synthesis and structure-activity relationships of a new model of arylpiperazines. 3.1 2-[omega-(4-arylpiperazin-1-yl)alkyl]perhydropyrrolo- [1,2-c]imidazoles and -perhydroimidazo[1,5-a]pyridines: study of the influence of the terminal amide fragment on 5-HT1A affinity/selectivity. J Med Chem40:2653-6 (1997) 
 
5-hydroxytryptamine receptor 1A
Name:5-hydroxytryptamine receptor 1A
Type:G Protein-Coupled Receptor (GPCR)
Mol. Mass.:46445.29
Organism:Rattus norvegicus (rat)
Description:Binding assays were performed using rat hippocampal membranes.
Residue:422
BDBM50054351
NameBDBM50054351
Synonyms:2-{4-[4-(3-Chloro-phenyl)-piperazin-1-yl]-butyl}-tetrahydro-pyrrolo[1,2-c]imidazole-1,3-dione | CHEMBL290039
TypeSmall organic molecule
Emp. Form.C20H27ClN4O2
Mol. Mass.390.907
SMILESOc1c2CCCn2c(=O)n1CCCCN1CCN(CC1)c1cccc(Cl)c1