Reaction Details
TargetAlpha-1A adrenergic receptor
LigandBDBM50054395
Substrate/Competitorn/a
Meas. Tech.ChEMBL_33283 (CHEMBL644243)
Ki 8.3±n/a nM
Citation López-Rodríguez, MLMorcillo, MJFernández, EPorras, EMurcia, MSanz, AMOrensanz, L Synthesis and structure-activity relationships of a new model of arylpiperazines. 3.1 2-[omega-(4-arylpiperazin-1-yl)alkyl]perhydropyrrolo- [1,2-c]imidazoles and -perhydroimidazo[1,5-a]pyridines: study of the influence of the terminal amide fragment on 5-HT1A affinity/selectivity. J Med Chem40:2653-6 (1997) 
 
Alpha-1A adrenergic receptor
Name:Alpha-1A adrenergic receptor
Type:Protein
Mol. Mass.:51620.15
Organism:Rattus norvegicus (Rat)
Description:P43140
Residue:466
BDBM50054395
NameBDBM50054395
Synonyms:2-{4-[4-(2-Methoxy-phenyl)-piperazin-1-yl]-butyl}-tetrahydro-pyrrolo[1,2-c]imidazole-1,3-dione | CHEMBL42810
TypeSmall organic molecule
Emp. Form.C21H30N4O3
Mol. Mass.386.4879
SMILESCOc1ccccc1N1CCN(CCCCn2c(O)c3CCCn3c2=O)CC1