Reaction Details
Target5-hydroxytryptamine receptor 1A
LigandBDBM50059470
Substrate/Competitorn/a
Meas. Tech.ChEMBL_1472 (CHEMBL616595)
Ki 5.1±n/a nM
Citation López-Rodríguez, MLMorcillo, MJFernández, EPorras, EMurcia, MSanz, AMOrensanz, L Synthesis and structure-activity relationships of a new model of arylpiperazines. 3.1 2-[omega-(4-arylpiperazin-1-yl)alkyl]perhydropyrrolo- [1,2-c]imidazoles and -perhydroimidazo[1,5-a]pyridines: study of the influence of the terminal amide fragment on 5-HT1A affinity/selectivity. J Med Chem40:2653-6 (1997) 
 
5-hydroxytryptamine receptor 1A
Name:5-hydroxytryptamine receptor 1A
Type:G Protein-Coupled Receptor (GPCR)
Mol. Mass.:46445.29
Organism:Rattus norvegicus (rat)
Description:Binding assays were performed using rat hippocampal membranes.
Residue:422
BDBM50059470
NameBDBM50059470
Synonyms:2-{4-[4-(2-Methoxy-phenyl)-piperazin-1-yl]-butyl}-octahydro-imidazo[1,5-a]pyridine | CHEMBL88715
TypeSmall organic molecule
Emp. Form.C22H36N4O
Mol. Mass.372.5474
SMILESCOc1ccccc1N1CCN(CCCCN2CC3CCCCN3C2)CC1