Reaction Details
TargetKappa-type opioid receptor
LigandBDBM50002346
Substrate/Competitorn/a
Meas. Tech.ChEMBL_146230 (CHEMBL754999)
Ki 1.7±n/a nM
Citation Choi, HMurray, TFDeLander, GESchmidt, WKAldrich, JV Synthesis and opioid activity of [D-Pro10]dynorphin A-(1-11) analogues with N-terminal alkyl substitution. J Med Chem40:2733-9 (1997) 
 
Kappa-type opioid receptor
Name:Kappa-type opioid receptor
Type:G Protein-Coupled Receptor (GPCR)
Mol. Mass.:42744.99
Organism:Cavia porcellus (domestic guinea pig)
Description:P41144
Residue:380
BDBM50002346
NameBDBM50002346
Synonyms:CHEMBL384584 | [D-pro10]Dynorphin A(1-11)
TypeSmall organic molecule
Emp. Form.C63H103N21O13
Mol. Mass.1362.6248
SMILESCC[C@H](C)[C@H](NC(=O)[C@H](CCCNC(N)=N)NC(=O)[C@H](CCCNC(N)=N)NC(=O)[C@H](CC(C)C)NC(=O)[C@H](Cc1ccccc1)NC(=O)CNC(=O)CNC(=O)[C@@H](N)Cc1ccc(O)cc1)C(=O)N[C@@H](CCCNC(N)=N)C(=O)N1CCC[C@@H]1C(=O)N[C@@H](CCCCN)C(O)=O