Reaction Details
TargetKappa-type opioid receptor
LigandBDBM50059583
Substrate/Competitorn/a
Meas. Tech.ChEMBL_147214 (CHEMBL755420)
Ki 0.029±n/a nM
Citation Choi, HMurray, TFDeLander, GESchmidt, WKAldrich, JV Synthesis and opioid activity of [D-Pro10]dynorphin A-(1-11) analogues with N-terminal alkyl substitution. J Med Chem40:2733-9 (1997) 
 
Kappa-type opioid receptor
Name:Kappa-type opioid receptor
Type:G Protein-Coupled Receptor (GPCR)
Mol. Mass.:42744.99
Organism:Cavia porcellus (domestic guinea pig)
Description:P41144
Residue:380
BDBM50059583
NameBDBM50059583
Synonyms:CHEMBL268818 PhCH2Tyr-Gly-Gly-Phe-Leu-Arg-Arg-lle-Arg-Pro-LysOH
TypeSmall organic molecule
Emp. Form.C70H109N21O13
Mol. Mass.1452.7474
SMILESCC[C@H](C)[C@H](NC(=O)[C@H](CCCNC(N)=N)NC(=O)[C@H](CCCNC(N)=N)NC(=O)[C@H](CC(C)C)NC(=O)[C@H](Cc1ccccc1)NC(=O)CNC(=O)CNC(=O)[C@H](Cc1ccc(O)cc1)NCc1ccccc1)C(=O)N[C@@H](CCCNC(N)=N)C(=O)N1CCC[C@H]1C(=O)N[C@@H](CCCCN)C(O)=O