Reaction Details
Target5-lipoxygenase
LigandBDBM50059598
Substrate/Competitorn/a
Meas. Tech.ChEMBL_157767 (CHEMBL767670)
IC50 6000±n/a nM
Citation Müller, KPrinz, H Antipsoriatic anthrones with modulated redox properties. 4. Synthesis and biological activity of novel 9,10-dihydro-1,8-dihydroxy-9-oxo-2-anthracenecarboxylic and -hydroxamic acids. J Med Chem40:2780-7 (1997) 
 
5-lipoxygenase
Name:5-lipoxygenase
Synonyms:Arachidonate 5-lipoxygenase
Type:PROTEIN
Mol. Mass.:49994.23
Organism:Bos taurus
Description:ChEMBL_157766
Residue:430
BDBM50059598
NameBDBM50059598
TypeSmall organic molecule
Emp. Form.C18H17NO5
Mol. Mass.327.3313
SMILESCC(C(=O)N(C)O)c1ccc2Cc3cccc(O)c3C(=O)c2c1O