Reaction Details
TargetIntegrin alpha-IIb/beta-3
LigandBDBM50059694
Substrate/Competitorn/a
Meas. Tech.ChEMBL_89709 (CHEMBL696412)
IC50 140±n/a nM
Citation Sall, DJArfsten, AEBastian, JADenney, MLHarms, CSMcCowan, JRMorin, JMRose, JWScarborough, RMSmyth, MSUm, SLUtterback, BGVasileff, RTWikel, JHWyss, VLJakubowski, JA Use of conformationally restricted benzamidines as arginine surrogates in the design of platelet GPIIb-IIIa receptor antagonists. J Med Chem40:2843-57 (1997) 
 
Integrin alpha-IIb/beta-3
Name:Integrin alpha-IIb/beta-3
Synonyms:Glycoprotein IIb/IIIa
Type:n/a
Mol. Mass.:n/a
Description:ASSAY_ID of EBI is 30109
Components:This complex has 2 components.
Component 1
Name:Integrin beta-3
Type:Protein
Mol. Mass.:87038.91
Organism:Homo sapiens (Human)
Description:P05106
Residue:788
Component 2
Name:Integrin alpha-IIb
Synonyms:CD_antigen=CD41 GPIIb Glycoprotein IIb ITGA2B Integrin alpha-IIb heavy chain Integrin alpha-IIb light chain, form 2 Integrin alpha-V/beta-3 and alpha-IIb/beta 3 | Platelet membrane glycoprotein IIb
Type:Protein
Mol. Mass.:113354.85
Organism:Homo sapiens (Human)
Description:P08514
Residue:1039
BDBM50059694
NameBDBM50059694
Synonyms:7-[(6-Carbamimidoyl-1H-indazole-3-carbonyl)-amino]-heptanoic acid | CHEMBL98461
TypeSmall organic molecule
Emp. Form.C16H21N5O3
Mol. Mass.331.3696
SMILESNC(=N)c1ccc2c([nH]nc2c1)C(=O)NCCCCCCC(O)=O