Reaction Details
TargetIntegrin alpha-IIb/beta-3
LigandBDBM50031565
Substrate/Competitorn/a
Meas. Tech.ChEMBL_89710 (CHEMBL696413)
IC50 35±n/a nM
Citation Sall, DJArfsten, AEBastian, JADenney, MLHarms, CSMcCowan, JRMorin, JMRose, JWScarborough, RMSmyth, MSUm, SLUtterback, BGVasileff, RTWikel, JHWyss, VLJakubowski, JA Use of conformationally restricted benzamidines as arginine surrogates in the design of platelet GPIIb-IIIa receptor antagonists. J Med Chem40:2843-57 (1997) 
 
Integrin alpha-IIb/beta-3
Name:Integrin alpha-IIb/beta-3
Synonyms:Glycoprotein IIb/IIIa
Type:n/a
Mol. Mass.:n/a
Description:ASSAY_ID of EBI is 30109
Components:This complex has 2 components.
Component 1
Name:Integrin beta-3
Type:Protein
Mol. Mass.:87038.91
Organism:Homo sapiens (Human)
Description:P05106
Residue:788
Component 2
Name:Integrin alpha-IIb
Synonyms:CD_antigen=CD41 GPIIb Glycoprotein IIb ITGA2B Integrin alpha-IIb heavy chain Integrin alpha-IIb light chain, form 2 Integrin alpha-V/beta-3 and alpha-IIb/beta 3 | Platelet membrane glycoprotein IIb
Type:Protein
Mol. Mass.:113354.85
Organism:Homo sapiens (Human)
Description:P08514
Residue:1039
BDBM50031565
NameBDBM50031565
Synonyms:(S)-3-[3-(4-Carbamimidoyl-phenylcarbamoyl)-propionylamino]-pent-4-ynoic acid 3-[3-(4-Carbamimidoyl-phenylcarbamoyl)-propionylamino]-pent-4-ynoic acid ethyl ester SC-54701A
TypeSmall organic molecule
Emp. Form.C16H18N4O4
Mol. Mass.330.3385
SMILESNC(=N)c1ccc(NC(=O)CCC(=O)N[C@@H](CC(O)=O)C#C)cc1