Reaction Details
TargetDihydrofolate reductase
LigandBDBM50059957
Substrate/Competitorn/a
Meas. Tech.ChEMBL_55294 (CHEMBL665205)
Ki 0.014±n/a nM
Citation Robson, CMeek, MAGrunwaldt, JDLambert, PAQueener, SFSchmidt, DGriffin, RJ Nonclassical 2,4-diamino-5-aryl-6-ethylpyrimidine antifolates: activity as inhibitors of dihydrofolate reductase from Pneumocystis carinii and Toxoplasma gondii and as antitumor agents. J Med Chem40:3040-8 (1997) 
 
Dihydrofolate reductase
Name:Dihydrofolate reductase
Type:Enzyme
Mol. Mass.:21638.84
Organism:Rattus norvegicus (rat)
Description:n/a
Residue:187
BDBM50059957
NameBDBM50059957
Synonyms:4-({[4-(2,4-Diamino-6-ethyl-pyrimidin-5-yl)-2-nitro-phenyl]-methyl-amino}-methyl)-benzoic acid methyl ester | CHEMBL449706
TypeSmall organic molecule
Emp. Form.C22H24N6O4
Mol. Mass.436.4638
SMILESCCc1nc(N)nc(N)c1-c1ccc(N(C)Cc2ccc(cc2)C(=O)OC)c(c1)[N+]([O-])=O