Reaction Details
TargetDihydrofolate reductase
LigandBDBM50058420
Substrate/Competitorn/a
Meas. Tech.ChEMBL_55294 (CHEMBL665205)
Ki 0.009±n/a nM
Citation Robson, CMeek, MAGrunwaldt, JDLambert, PAQueener, SFSchmidt, DGriffin, RJ Nonclassical 2,4-diamino-5-aryl-6-ethylpyrimidine antifolates: activity as inhibitors of dihydrofolate reductase from Pneumocystis carinii and Toxoplasma gondii and as antitumor agents. J Med Chem40:3040-8 (1997) 
 
Dihydrofolate reductase
Name:Dihydrofolate reductase
Type:Enzyme
Mol. Mass.:21638.84
Organism:Rattus norvegicus (rat)
Description:n/a
Residue:187
BDBM50058420
NameBDBM50058420
Synonyms:(methylbenzoprim, MBP) 5-[4-(Benzyl-methyl-amino)-3-nitro-phenyl]-6-ethyl-pyrimidine-2,4-diamine CHEMBL56170 | cid_72438
TypeSmall organic molecule
Emp. Form.C20H22N6O2
Mol. Mass.378.4277
SMILESCCc1nc(N)nc(N)c1-c1ccc(N(C)Cc2ccccc2)c(c1)[N+]([O-])=O