Reaction Details
TargetDelta-type opioid receptor
LigandBDBM50059997
Substrate/Competitorn/a
Meas. Tech.ChEMBL_146341 (CHEMBL753790)
Ki 0.0019±n/a nM
Citation Fang, XLarson, DLPortoghese, PS 7-spirobenzocyclohexyl derivatives of naltrexone, oxymorphone, and hydromorphone as selective opioid receptor ligands. J Med Chem40:3064-70 (1997) 
 
Delta-type opioid receptor
Name:Delta-type opioid receptor
Type:Enzyme Catalytic Domain
Mol. Mass.:40577.25
Organism:MOUSE
Description:P32300
Residue:372
BDBM50059997
NameBDBM50059997
Synonyms:7 beta-Spirobenzocyclohexylnaltrexone | CHEMBL101694
TypeSmall organic molecule
Emp. Form.C29H31NO4
Mol. Mass.457.5607
SMILESOc1ccc2CC3N(CC4CC4)CCC45[C@@H](Oc1c24)C(=O)[C@@]1(CCc2ccccc2C1)C[C@@]35O