Reaction Details
TargetGTPase HRas
LigandBDBM50060144
Substrate/Competitorn/a
Meas. Tech.ChEMBL_76422 (CHEMBL685869)
IC50 710±n/a nM
Citation McNamara, DJDobrusin, ELeonard, DMShuler, KRKaltenbronn, JSQuin, JBur, SThomas, CEDoherty, AMScholten, JDZimmerman, KKGibbs, BSGowan, RCLatash, MPLeopold, WRPrzybranowski, SASebolt-Leopold, JS C-terminal modifications of histidyl-N-benzylglycinamides to give improved inhibition of Ras farnesyltransferase, cellular activity, and anticancer activity in mice. J Med Chem40:3319-22 (1997) 
 
GTPase HRas
Name:GTPase HRas
Type:Other Protein Type
Mol. Mass.:21293.37
Organism:Homo sapiens (Human)
Description:P01112
Residue:189
BDBM50060144
NameBDBM50060144
Synonyms:CHEMBL325073 | [(S)-1-{(4-Benzyloxy-benzyl)-[((R)-1-methyl-2-phenyl-ethylcarbamoyl)-methyl]-carbamoyl}-2-(3H-imidazol-4-yl)-ethyl]-carbamic acid benzyl ester
TypeSmall organic molecule
Emp. Form.C39H41N5O5
Mol. Mass.659.7733
SMILESC[C@H](Cc1ccccc1)NC(=O)CN(Cc1ccc(OCc2ccccc2)cc1)C(=O)[C@H](Cc1cnc[nH]1)NC(=O)OCc1ccccc1