Reaction Details
TargetGastrin/cholecystokinin type B receptor
LigandBDBM50060321
Substrate/Competitorn/a
Meas. Tech.ChEMBL_48609 (CHEMBL659590)
Ki 342±n/a nM
Citation Martín-Martínez, MBartolomé-Nebreda, JMGómez-Monterrey, IGonzález-Muñiz, RGarcía-López, MTBallaz, SBarber, AFortuño, ADel Río, JHerranz, R Synthesis and stereochemical structure-activity relationships of 1,3-dioxoperhydropyrido[1,2-c]pyrimidine derivatives: potent and selective cholecystokinin-A receptor antagonists. J Med Chem40:3402-7 (1997) 
 
Gastrin/cholecystokinin type B receptor
Name:Gastrin/cholecystokinin type B receptor
Type:Enzyme Catalytic Domain
Mol. Mass.:48980.43
Organism:RAT
Description:Cholecystokinin A CCKBR RAT::P30553
Residue:452
BDBM50060321
NameBDBM50060321
Synonyms:1H-Indole-2-carboxylic acid ((R)-1-methyl-2-oxo-5-phenyl-2,3-dihydro-1H-benzo[e][1,4]diazepin-3-yl)-amide CCK antagonist synthetic 19 | CHEMBL419764
TypeSmall organic molecule
Emp. Form.C25H20N4O2
Mol. Mass.408.4519
SMILESCN1c2ccccc2C(=N[C@@H](NC(=O)c2cc3ccccc3[nH]2)C1=O)c1ccccc1