Reaction Details
TargetNeutrophil elastase
LigandBDBM50279769
Substrate/Competitorn/a
Meas. Tech.ChEMBL_63999 (CHEMBL673108)
Ki 4±n/a nM
Citation Regan, JMcGarry, DBruno, JGreen, DNewman, JHsu, CYKline, JBarton, JTravis, JChoi, YMVolz, FPauls, HHarrison, RZilberstein, ABen-Sasson, SAChang, M Anionic- and lipophilic-mediated surface binding inhibitors of human leukocyte elastase. J Med Chem40:3408-22 (1997) 
 
Neutrophil elastase
Name:Neutrophil elastase
Type:Enzyme
Mol. Mass.:28532.38
Organism:Homo sapiens (Human)
Description:P08246
Residue:267
BDBM50279769
NameBDBM50279769
Synonyms:(S)-1-{(R)-2-[4-(4-Bromo-benzenesulfonylaminocarbonyl)-benzoylamino]-3-methyl-butyryl}-pyrrolidine-2-carboxylic acid (3,3,3-trifluoro-1-isopropyl-2-oxo-propyl)-amide | CHEMBL116606
TypeSmall organic molecule
Emp. Form.C30H34BrF3N4O7S
Mol. Mass.731.578
SMILESCC(C)[C@@H](NC(=O)c1ccc(cc1)C(=O)NS(=O)(=O)c1ccc(Br)cc1)C(=O)N1CCC[C@H]1C(=O)NC(C(C)C)C(=O)C(F)(F)F