Reaction Details
TargetNeutrophil elastase
LigandBDBM50279766
Substrate/Competitorn/a
Meas. Tech.ChEMBL_63999 (CHEMBL673108)
Ki 200±n/a nM
Citation Regan, JMcGarry, DBruno, JGreen, DNewman, JHsu, CYKline, JBarton, JTravis, JChoi, YMVolz, FPauls, HHarrison, RZilberstein, ABen-Sasson, SAChang, M Anionic- and lipophilic-mediated surface binding inhibitors of human leukocyte elastase. J Med Chem40:3408-22 (1997) 
 
Neutrophil elastase
Name:Neutrophil elastase
Type:Enzyme
Mol. Mass.:28532.38
Organism:Homo sapiens (Human)
Description:P08246
Residue:267
BDBM50279766
NameBDBM50279766
Synonyms:CHEMBL213783 | {2-{5-Benzyloxy-4-[4-(5-benzyloxy-4-hydroxymethyl-2-methoxy-benzyl)-5-carboxymethoxy-2-methoxy-benzyl]-2-methoxy-benzyl}-5-[2-benzyloxy-4-(2-carboxymethoxy-5-hydroxy-benzyl)-5-methoxy-benzyl]-4-methoxy-phenoxy}-acetic acid
TypeSmall organic molecule
Emp. Form.C74H72O19
Mol. Mass.1265.3521
SMILESCOc1cc(CO)c(OCc2ccccc2)cc1Cc1cc(OC)c(Cc2cc(OC)c(Cc3cc(OC)c(Cc4cc(OC)c(Cc5cc(O)ccc5OCC(O)=O)cc4OCc4ccccc4)cc3OCC(O)=O)cc2OCc2ccccc2)cc1OCC(O)=O