Reaction Details
TargetNeutrophil elastase
LigandBDBM50279771
Substrate/Competitorn/a
Meas. Tech.ChEMBL_63999 (CHEMBL673108)
Ki 130±n/a nM
Citation Regan, JMcGarry, DBruno, JGreen, DNewman, JHsu, CYKline, JBarton, JTravis, JChoi, YMVolz, FPauls, HHarrison, RZilberstein, ABen-Sasson, SAChang, M Anionic- and lipophilic-mediated surface binding inhibitors of human leukocyte elastase. J Med Chem40:3408-22 (1997) 
 
Neutrophil elastase
Name:Neutrophil elastase
Type:Enzyme
Mol. Mass.:28532.38
Organism:Homo sapiens (Human)
Description:P08246
Residue:267
BDBM50279771
NameBDBM50279771
Synonyms:CHEMBL217744 | [4-Benzyloxy-5-{5-benzyloxy-4-[5-benzyloxy-2-carboxymethoxy-4-(2-carboxymethoxy-5-hydroxy-benzyl)-benzyl]-2-carboxymethoxy-benzyl}-2-(2-benzyloxy-5-carboxymethoxy-4-hydroxymethyl-benzyl)-phenoxy]-acetic acid
TypeSmall organic molecule
Emp. Form.C73H66O21
Mol. Mass.1279.2925
SMILESOCc1cc(OCc2ccccc2)c(Cc2cc(OCc3ccccc3)c(Cc3cc(OCc4ccccc4)c(Cc4cc(OCc5ccccc5)c(Cc5cc(O)ccc5OCC(O)=O)cc4OCC(O)=O)cc3OCC(O)=O)cc2OCC(O)=O)cc1OCC(O)=O