Reaction Details
TargetChymotrypsin-like elastase family member 2A
LigandBDBM50454654
Substrate/Competitorn/a
Meas. Tech.ChEMBL_156951 (CHEMBL762661)
IC50 500000±n/a nM
Citation Buynak, JDRao, ASFord, GPCarver, CAdam, GGeng, BBachmann, BShobassy, SLackey, S 7-alkylidenecephalosporin esters as inhibitors of human leukocyte elastase. J Med Chem40:3423-33 (1997) 
 
Chymotrypsin-like elastase family member 2A
Name:Chymotrypsin-like elastase family member 2A
Type:PROTEIN
Mol. Mass.:28705.23
Organism:Sus scrofa
Description:ChEMBL_156951
Residue:269
BDBM50454654
NameBDBM50454654
Synonyms:CHEMBL2311166
TypeSmall organic molecule
Emp. Form.C22H35ClN4O7
Mol. Mass.502.989
SMILESCOC(=O)CCC(=O)N[C@@H](C)C(=O)N[C@@H](C)C(=O)N1CCC[C@H]1C(=O)N[C@@H](C(C)C)C(=O)CCl