Reaction Details
Target5-hydroxytryptamine receptor 1D
LigandBDBM50060426
Substrate/Competitorn/a
Meas. Tech.ChEMBL_1697 (CHEMBL616904)
IC50 0.3±n/a nM
Citation Castro, JLStreet, LJGuiblin, ARJelley, RARussell, MGSternfeld, FBeer, MSStanton, JAMatassa, VG 3-[2-(Pyrrolidin-1-yl)ethyl]indoles and 3-[3-(piperidin-1-yl)propyl]indoles: agonists for the h5-HT1D receptor with high selectivity over the h5-HT1B subtype. J Med Chem40:3497-500 (1997) 
 
5-hydroxytryptamine receptor 1D
Name:5-hydroxytryptamine receptor 1D
Type:G Protein-Coupled Receptor (GPCR)
Mol. Mass.:41920.63
Organism:Homo sapiens (Human)
Description:Receptor binding assays were performed using human clone stably expressed in CHO cells.
Residue:377
BDBM50060426
NameBDBM50060426
Synonyms:CHEMBL296161 L-741604
TypeSmall organic molecule
Emp. Form.C14H17N5
Mol. Mass.255.3183
SMILESCN(C)CCc1c[nH]c2ccc(cc12)-n1cnnc1