Reaction Details
Target5-hydroxytryptamine receptor 1A
LigandBDBM50060437
Substrate/Competitorn/a
Meas. Tech.ChEMBL_1561 (CHEMBL616382)
IC50 55±n/a nM
Citation MacLeod, AMStreet, LJReeve, AJJelley, RASternfeld, FBeer, MSStanton, JAWatt, APRathbone, DMatassa, VG Selective, orally active 5-HT1D receptor agonists as potential antimigraine agents. J Med Chem40:3501-3 (1997) 
 
5-hydroxytryptamine receptor 1A
Name:5-hydroxytryptamine receptor 1A
Type:Enzyme
Mol. Mass.:46192.09
Organism:Mus musculus (Mouse)
Description:Q64264
Residue:421
BDBM50060437
NameBDBM50060437
Synonyms:3-(3-{4-[2-(3-Fluoro-phenyl)-ethyl]-piperazin-1-yl}-propyl)-5-[1,2,4]triazol-4-yl-1H-indole CHEMBL292779 | L-775606
TypeSmall organic molecule
Emp. Form.C25H29FN6
Mol. Mass.432.5364
SMILESFc1cccc(CCN2CCN(CCCc3c[nH]c4ccc(cc34)-n3cnnc3)CC2)c1