Reaction Details
TargetAcetylcholinesterase
LigandBDBM9074
Substrate/Competitorn/a
Meas. Tech.ChEMBL_29098 (CHEMBL636836)
IC50 350±n/a nM
Citation McKenna, MTProctor, GRYoung, LCHarvey, AL Novel tacrine analogues for potential use against Alzheimer's disease: potent and selective acetylcholinesterase inhibitors and 5-HT uptake inhibitors. J Med Chem40:3516-23 (1997) 
 
Acetylcholinesterase
Name:Acetylcholinesterase
Type:Enzyme
Mol. Mass.:68193.62
Organism:Rattus norvegicus (rat)
Description:P37136
Residue:614
BDBM9074
NameBDBM9074
Synonyms:10H-indeno[1,2-b]quinolin-11-amine CHEMBL60167
TypeSmall organic molecule
Emp. Form.C16H12N2
Mol. Mass.232.2799
SMILESNc1c2Cc3ccccc3-c2nc2ccccc12