Reaction Details
TargetSodium-dependent serotonin transporter
LigandBDBM50060481
Substrate/Competitorn/a
Meas. Tech.ChEMBL_192825 (CHEMBL872975)
IC50 4600±n/a nM
Citation McKenna, MTProctor, GRYoung, LCHarvey, AL Novel tacrine analogues for potential use against Alzheimer's disease: potent and selective acetylcholinesterase inhibitors and 5-HT uptake inhibitors. J Med Chem40:3516-23 (1997) 
 
Sodium-dependent serotonin transporter
Name:Sodium-dependent serotonin transporter
Type:Multi-pass membrane protein
Mol. Mass.:70168.43
Organism:Rattus norvegicus (rat)
Description:P31652
Residue:630
BDBM50060481
NameBDBM50060481
Synonyms:5,6-Dihydro-benzo[c]acridin-7-ylamine CHEMBL89012
TypeSmall organic molecule
Emp. Form.C17H14N2
Mol. Mass.246.3065
SMILESNc1c2CCc3ccccc3-c2nc2ccccc12