Reaction Details
TargetSodium-dependent serotonin transporter
LigandBDBM50060474
Substrate/Competitorn/a
Meas. Tech.ChEMBL_192825 (CHEMBL872975)
IC50 700±n/a nM
Citation McKenna, MTProctor, GRYoung, LCHarvey, AL Novel tacrine analogues for potential use against Alzheimer's disease: potent and selective acetylcholinesterase inhibitors and 5-HT uptake inhibitors. J Med Chem40:3516-23 (1997) 
 
Sodium-dependent serotonin transporter
Name:Sodium-dependent serotonin transporter
Type:Multi-pass membrane protein
Mol. Mass.:70168.43
Organism:Rattus norvegicus (rat)
Description:P31652
Residue:630
BDBM50060474
NameBDBM50060474
Synonyms:3-Methoxy-6,7-dihydro-5H-13-aza-benzo[3,4]cyclohepta[1,2-b]naphthalen-8-ylamine | CHEMBL119634
TypeSmall organic molecule
Emp. Form.C19H18N2O
Mol. Mass.290.359
SMILESCOc1ccc-2c(CCCc3c(N)c4ccccc4nc-23)c1