Reaction Details
TargetCholinesterase
LigandBDBM50060476
Substrate/Competitorn/a
Meas. Tech.ChEMBL_41408 (CHEMBL653528)
IC50 6700±n/a nM
Citation McKenna, MTProctor, GRYoung, LCHarvey, AL Novel tacrine analogues for potential use against Alzheimer's disease: potent and selective acetylcholinesterase inhibitors and 5-HT uptake inhibitors. J Med Chem40:3516-23 (1997) 
 
Cholinesterase
Name:Cholinesterase
Type:Homotetramer
Mol. Mass.:68422.27
Organism:Homo sapiens (Human)
Description:P06276
Residue:602
BDBM50060476
NameBDBM50060476
Synonyms:5,6,7,8-tetrahydrobenzo[2,3]azocino[4,5-b]quinolin-9-amine CHEMBL325203
TypeSmall organic molecule
Emp. Form.C18H17N3
Mol. Mass.275.3477
SMILESNc1c2CCCNc3ccccc3-c2nc2ccccc12