Reaction Details
TargetTransporter
LigandBDBM50060476
Substrate/Competitorn/a
Meas. Tech.ChEMBL_192826 (CHEMBL797692)
IC50 2500±n/a nM
Citation McKenna, MTProctor, GRYoung, LCHarvey, AL Novel tacrine analogues for potential use against Alzheimer's disease: potent and selective acetylcholinesterase inhibitors and 5-HT uptake inhibitors. J Med Chem40:3516-23 (1997) 
 
Transporter
Name:Transporter
Type:PROTEIN
Mol. Mass.:66787.87
Organism:Rattus norvegicus
Description:ChEMBL_1463061
Residue:597
BDBM50060476
NameBDBM50060476
Synonyms:5,6,7,8-tetrahydrobenzo[2,3]azocino[4,5-b]quinolin-9-amine CHEMBL325203
TypeSmall organic molecule
Emp. Form.C18H17N3
Mol. Mass.275.3477
SMILESNc1c2CCCNc3ccccc3-c2nc2ccccc12