Reaction Details
TargetTransporter
LigandBDBM50060477
Substrate/Competitorn/a
Meas. Tech.ChEMBL_192826 (CHEMBL797692)
IC50 600±n/a nM
Citation McKenna, MTProctor, GRYoung, LCHarvey, AL Novel tacrine analogues for potential use against Alzheimer's disease: potent and selective acetylcholinesterase inhibitors and 5-HT uptake inhibitors. J Med Chem40:3516-23 (1997) 
 
Transporter
Name:Transporter
Type:PROTEIN
Mol. Mass.:66787.87
Organism:Rattus norvegicus
Description:ChEMBL_1463061
Residue:597
BDBM50060477
NameBDBM50060477
Synonyms:2,3-Dihydro-1H-cyclopenta[b]quinolin-9-ylamine CHEMBL118752
TypeSmall organic molecule
Emp. Form.C12H12N2
Mol. Mass.184.2371
SMILESNc1c2CCCc2nc2ccccc12