Reaction Details
TargetSodium-dependent serotonin transporter
LigandBDBM30130
Substrate/Competitorn/a
Meas. Tech.ChEMBL_192825 (CHEMBL872975)
IC50 130±n/a nM
Citation McKenna, MTProctor, GRYoung, LCHarvey, AL Novel tacrine analogues for potential use against Alzheimer's disease: potent and selective acetylcholinesterase inhibitors and 5-HT uptake inhibitors. J Med Chem40:3516-23 (1997) 
 
Sodium-dependent serotonin transporter
Name:Sodium-dependent serotonin transporter
Type:Multi-pass membrane protein
Mol. Mass.:70168.43
Organism:Rattus norvegicus (rat)
Description:P31652
Residue:630
BDBM30130
NameBDBM30130
Synonyms:CHEMBL1201082 Fluoxetin Prozac cid_62857
TypeSmall organic molecule
Emp. Form.C17H18F3NO
Mol. Mass.309.3261
SMILESCNCCC(Oc1ccc(cc1)C(F)(F)F)c1ccccc1