Reaction Details
TargetSodium-dependent serotonin transporter
LigandBDBM50060478
Substrate/Competitorn/a
Meas. Tech.ChEMBL_192825 (CHEMBL872975)
IC50 5800±n/a nM
Citation McKenna, MTProctor, GRYoung, LCHarvey, AL Novel tacrine analogues for potential use against Alzheimer's disease: potent and selective acetylcholinesterase inhibitors and 5-HT uptake inhibitors. J Med Chem40:3516-23 (1997) 
 
Sodium-dependent serotonin transporter
Name:Sodium-dependent serotonin transporter
Type:Multi-pass membrane protein
Mol. Mass.:70168.43
Organism:Rattus norvegicus (rat)
Description:P31652
Residue:630
BDBM50060478
NameBDBM50060478
Synonyms:3-Methoxy-5,6-dihydro-benzo[c]acridin-7-ylamine CHEMBL118033
TypeSmall organic molecule
Emp. Form.C18H16N2O
Mol. Mass.276.3324
SMILESCOc1ccc-2c(CCc3c(N)c4ccccc4nc-23)c1