Reaction Details
TargetSerine protease 1
LigandBDBM50060748
Substrate/Competitorn/a
Meas. Tech.ChEMBL_212515 (CHEMBL817580)
Ki 8300±n/a nM
Citation Feng, DMGardell, SJLewis, SDBock, MGChen, ZFreidinger, RMNaylor-Olsen, AMRamjit, HGWoltmann, RBaskin, EPLynch, JJLucas, RShafer, JADancheck, KBChen, IWMao, SSKrueger, JAHare, TRMulichak, AMVacca, JP Discovery of a novel, selective, and orally bioavailable class of thrombin inhibitors incorporating aminopyridyl moieties at the P1 position. J Med Chem40:3726-33 (1997) 
 
Serine protease 1
Name:Serine protease 1
Type:Enzyme
Mol. Mass.:25790.52
Organism:Bos taurus (bovine)
Description:P00760
Residue:246
BDBM50060748
NameBDBM50060748
Synonyms:(S)-1-((R)-2-Amino-3,3-diphenyl-propionyl)-pyrrolidine-2-carboxylic acid (6-amino-2,4-dimethyl-pyridin-3-ylmethyl)-amide | CHEMBL122601
TypeSmall organic molecule
Emp. Form.C28H33N5O2
Mol. Mass.471.5939
SMILESCc1cc(N)nc(C)c1CNC(=O)[C@@H]1CCCN1C(=O)[C@H](N)C(c1ccccc1)c1ccccc1