Reaction Details
TargetCoagulation factor X
LigandBDBM50060745
Substrate/Competitorn/a
Meas. Tech.ChEMBL_48806 (CHEMBL662831)
Ki 10000±n/a nM
Citation Feng, DMGardell, SJLewis, SDBock, MGChen, ZFreidinger, RMNaylor-Olsen, AMRamjit, HGWoltmann, RBaskin, EPLynch, JJLucas, RShafer, JADancheck, KBChen, IWMao, SSKrueger, JAHare, TRMulichak, AMVacca, JP Discovery of a novel, selective, and orally bioavailable class of thrombin inhibitors incorporating aminopyridyl moieties at the P1 position. J Med Chem40:3726-33 (1997) 
 
Coagulation factor X
Name:Coagulation factor X
Type:Enzyme
Mol. Mass.:54726.60
Organism:Homo sapiens (Human)
Description:n/a
Residue:488
BDBM50060745
NameBDBM50060745
Synonyms:(S)-1-[(R)-3-(3,4-Dichloro-phenyl)-2-phenylmethanesulfonylamino-propionyl]-pyrrolidine-2-carboxylic acid 4-amino-benzylamide | CHEMBL122801
TypeSmall organic molecule
Emp. Form.C28H30Cl2N4O4S
Mol. Mass.589.533
SMILESNc1ccc(CNC(=O)[C@@H]2CCCN2C(=O)[C@@H](Cc2ccc(Cl)c(Cl)c2)NS(=O)(=O)Cc2ccccc2)cc1