Reaction Details
TargetCoagulation factor X
LigandBDBM50060747
Substrate/Competitorn/a
Meas. Tech.ChEMBL_48806 (CHEMBL662831)
Ki 52000±n/a nM
Citation Feng, DMGardell, SJLewis, SDBock, MGChen, ZFreidinger, RMNaylor-Olsen, AMRamjit, HGWoltmann, RBaskin, EPLynch, JJLucas, RShafer, JADancheck, KBChen, IWMao, SSKrueger, JAHare, TRMulichak, AMVacca, JP Discovery of a novel, selective, and orally bioavailable class of thrombin inhibitors incorporating aminopyridyl moieties at the P1 position. J Med Chem40:3726-33 (1997) 
 
Coagulation factor X
Name:Coagulation factor X
Type:Enzyme
Mol. Mass.:54726.60
Organism:Homo sapiens (Human)
Description:n/a
Residue:488
BDBM50060747
NameBDBM50060747
Synonyms:(S)-1-[(R)-3-(3,4-Dichloro-phenyl)-2-phenylmethanesulfonylamino-propionyl]-pyrrolidine-2-carboxylic acid (6-amino-2,4-dimethyl-pyridin-3-ylmethyl)-amide | CHEMBL338788
TypeSmall organic molecule
Emp. Form.C29H33Cl2N5O4S
Mol. Mass.618.574
SMILESCc1cc(N)nc(C)c1CNC(=O)[C@@H]1CCCN1C(=O)[C@@H](Cc1ccc(Cl)c(Cl)c1)NS(=O)(=O)Cc1ccccc1