Reaction Details
TargetCoagulation factor X
LigandBDBM50060741
Substrate/Competitorn/a
Meas. Tech.ChEMBL_48806 (CHEMBL662831)
Ki 4400±n/a nM
Citation Feng, DMGardell, SJLewis, SDBock, MGChen, ZFreidinger, RMNaylor-Olsen, AMRamjit, HGWoltmann, RBaskin, EPLynch, JJLucas, RShafer, JADancheck, KBChen, IWMao, SSKrueger, JAHare, TRMulichak, AMVacca, JP Discovery of a novel, selective, and orally bioavailable class of thrombin inhibitors incorporating aminopyridyl moieties at the P1 position. J Med Chem40:3726-33 (1997) 
 
Coagulation factor X
Name:Coagulation factor X
Type:Enzyme
Mol. Mass.:54726.60
Organism:Homo sapiens (Human)
Description:n/a
Residue:488
BDBM50060741
NameBDBM50060741
Synonyms:((R)-2-{(S)-2-[(6-Amino-pyridin-3-ylmethyl)-carbamoyl]-pyrrolidin-1-yl}-1-dicyclohexylmethyl-2-oxo-ethyl)-carbamic acid tert-butyl ester | CHEMBL122331
TypeSmall organic molecule
Emp. Form.C31H49N5O4
Mol. Mass.555.7519
SMILESCC(C)(C)OC(=O)N[C@H](C(C1CCCCC1)C1CCCCC1)C(=O)N1CCC[C@H]1C(=O)NCc1ccc(N)nc1