Reaction Details
TargetProthrombin
LigandBDBM50060752
Substrate/Competitorn/a
Meas. Tech.ChEMBL_208362 (CHEMBL813672)
Ki 3.9±n/a nM
Citation Feng, DMGardell, SJLewis, SDBock, MGChen, ZFreidinger, RMNaylor-Olsen, AMRamjit, HGWoltmann, RBaskin, EPLynch, JJLucas, RShafer, JADancheck, KBChen, IWMao, SSKrueger, JAHare, TRMulichak, AMVacca, JP Discovery of a novel, selective, and orally bioavailable class of thrombin inhibitors incorporating aminopyridyl moieties at the P1 position. J Med Chem40:3726-33 (1997) 
 
Prothrombin
Name:Prothrombin
Type:Protein
Mol. Mass.:70029.57
Organism:Homo sapiens (Human)
Description:P00734
Residue:622
BDBM50060752
NameBDBM50060752
Synonyms:(S)-1-((R)-2-Amino-3,3-dicyclohexyl-propionyl)-pyrrolidine-2-carboxylic acid (6-amino-2,4-dimethyl-pyridin-3-ylmethyl)-amide | CHEMBL123942
TypeSmall organic molecule
Emp. Form.C28H45N5O2
Mol. Mass.483.6892
SMILESCc1cc(N)nc(C)c1CNC(=O)[C@@H]1CCCN1C(=O)[C@H](N)C(C1CCCCC1)C1CCCCC1