Reaction Details
TargetProthrombin
LigandBDBM50060756
Substrate/Competitorn/a
Meas. Tech.ChEMBL_208362 (CHEMBL813672)
Ki 560±n/a nM
Citation Feng, DMGardell, SJLewis, SDBock, MGChen, ZFreidinger, RMNaylor-Olsen, AMRamjit, HGWoltmann, RBaskin, EPLynch, JJLucas, RShafer, JADancheck, KBChen, IWMao, SSKrueger, JAHare, TRMulichak, AMVacca, JP Discovery of a novel, selective, and orally bioavailable class of thrombin inhibitors incorporating aminopyridyl moieties at the P1 position. J Med Chem40:3726-33 (1997) 
 
Prothrombin
Name:Prothrombin
Type:Protein
Mol. Mass.:70029.57
Organism:Homo sapiens (Human)
Description:P00734
Residue:622
BDBM50060756
NameBDBM50060756
Synonyms:((R)-2-{(S)-2-[(5-Amino-thiophen-3-ylmethyl)-carbamoyl]-pyrrolidin-1-yl}-1-dicyclohexylmethyl-2-oxo-ethyl)-carbamic acid tert-butyl ester | CHEMBL421272
TypeSmall organic molecule
Emp. Form.C30H48N4O4S
Mol. Mass.560.792
SMILESCC(C)(C)OC(=O)N[C@H](C(C1CCCCC1)C1CCCCC1)C(=O)N1CCC[C@H]1C(=O)NCc1csc(N)c1