Reaction Details
TargetProthrombin
LigandBDBM50060749
Substrate/Competitorn/a
Meas. Tech.ChEMBL_208362 (CHEMBL813672)
Ki 350±n/a nM
Citation Feng, DMGardell, SJLewis, SDBock, MGChen, ZFreidinger, RMNaylor-Olsen, AMRamjit, HGWoltmann, RBaskin, EPLynch, JJLucas, RShafer, JADancheck, KBChen, IWMao, SSKrueger, JAHare, TRMulichak, AMVacca, JP Discovery of a novel, selective, and orally bioavailable class of thrombin inhibitors incorporating aminopyridyl moieties at the P1 position. J Med Chem40:3726-33 (1997) 
 
Prothrombin
Name:Prothrombin
Type:Protein
Mol. Mass.:70029.57
Organism:Homo sapiens (Human)
Description:P00734
Residue:622
BDBM50060749
NameBDBM50060749
Synonyms:(S)-1-((R)-2-Amino-3,3-diphenyl-propionyl)-pyrrolidine-2-carboxylic acid (2-amino-thiazol-4-ylmethyl)-amide | CHEMBL122432
TypeSmall organic molecule
Emp. Form.C24H27N5O2S
Mol. Mass.449.568
SMILESN[C@H](C(c1ccccc1)c1ccccc1)C(=O)N1CCC[C@H]1C(=O)NCc1csc(N)n1