Reaction Details
Target5-lipoxygenase
LigandBDBM50031472
Substrate/Competitorn/a
Meas. Tech.ChEMBL_157766 (CHEMBL767669)
IC50 4000±n/a nM
Citation Müller, KPrinz, HGawlik, IZiereis, KHuang, HS Simple analogues of anthralin: unusual specificity of structure and antiproliferative activity. J Med Chem40:3773-80 (1997) 
 
5-lipoxygenase
Name:5-lipoxygenase
Synonyms:Arachidonate 5-lipoxygenase
Type:PROTEIN
Mol. Mass.:49994.23
Organism:Bos taurus
Description:ChEMBL_157766
Residue:430
BDBM50031472
NameBDBM50031472
TypeSmall organic molecule
Emp. Form.C6H6O3
Mol. Mass.126.11
SMILESOc1cccc(O)c1O